licoreim_wp3 init

3 jobs for dev_licoreim_wp3 in 3 minutes and 11 seconds (queued for 1 second)
Status Job ID Name Coverage
  Build
failed #69672
ci-ubuntu
build_ubuntu

00:01:57

failed #69671
vind-pone-ci02
build_x64

00:03:10

failed #69670
vind-pone-ci02
build_x86

00:03:08

 
Name Stage Failure
failed
build_x64 Build
[101/157] Building Fortran object src\individual_pitch_controller\CMakeFiles\cyclic_pitch_controller.dir\__\__\utils\io\logging.f90.obj
[102/157] Building Fortran preprocessed src\flap_controller_cyclic\CMakeFiles\flap_controller_cyclic.dir\__\modules\global_variables.f90-pp.f90
[103/157] Building Fortran preprocessed src\flap_controller_cyclic\CMakeFiles\flap_controller_cyclic.dir\flap_controller_cyclic_fcns.f90-pp.f90
[104/157] Building Fortran preprocessed src\flap_controller_cyclic\CMakeFiles\flap_controller_cyclic.dir\__\modules\global_constants.f90-pp.f90
[105/157] Linking Fortran shared library src\dtu_we_controller\dtu_we_controller_64.dll
Creating library src\dtu_we_controller\dtu_we_controller.lib and object src\dtu_we_controller\dtu_we_controller.exp
LINK : warning LNK4217: symbol 'echo_version' defined in 'BuildInfo.f90.obj' is imported by 'dtu_we_controller.f90.obj' in function 'init_regulation_advanced'
ninja: build stopped: subcommand failed.
ERROR: Job failed: exit code 1
failed
build_x86 Build
ifort: error #10298: problem during post processing of parallel object compilation
compilation aborted for src\dtu_we_controller_bladed\CMakeFiles\DTUWEC_for_OpenFAST.dir\dtu_we_controller_bladed.f90-pp.f90 (code 1)
[112/157] Building Fortran object src\individual_pitch_controller\CMakeFiles\cyclic_pitch_controller.dir\__\__\utils\io\path_utils.f90.obj
[113/157] Building Fortran object src\individual_pitch_controller\CMakeFiles\cyclic_pitch_controller.dir\__\__\utils\io\dll_utils_intel.f90.obj
[114/157] Building Fortran preprocessed src\flap_controller_individual_aep_u_f\CMakeFiles\individual_flap_controller.dir\__\__\utils\portability\support_compiler_intel.f90-pp.f90
[115/157] Building Fortran preprocessed src\flap_controller_cyclic\CMakeFiles\flap_controller_cyclic.dir\flap_controller_cyclic.f90-pp.f90
[116/157] Building Fortran preprocessed src\flap_controller_individual_aep_u_f\CMakeFiles\individual_flap_controller.dir\__\__\utils\portability\filesystem_tools_intel.f90-pp.f90
ninja: build stopped: subcommand failed.
ERROR: Job failed: exit code 1
failed
build_ubuntu Build
-------------------------------------^
ifort: error #10298: problem during post processing of parallel object compilation
compilation aborted for /builds/OpenLAC/BasicDTUController/src/dtu_we_controller_bladed/dtu_we_controller_bladed.f90 (code 1)
make[2]: *** [src/dtu_we_controller_bladed/CMakeFiles/DTUWEC_for_OpenFAST.dir/build.make:128: src/dtu_we_controller_bladed/CMakeFiles/DTUWEC_for_OpenFAST.dir/dtu_we_controller_bladed.f90.o] Error 1
make[1]: *** [CMakeFiles/Makefile2:205: src/dtu_we_controller_bladed/CMakeFiles/DTUWEC_for_OpenFAST.dir/all] Error 2
make[1]: *** Waiting for unfinished jobs....
[ 98%] Built target dtu_we_controller
make: *** [Makefile:84: all] Error 2
ERROR: Job failed: exit code 1