some more fixes

4 jobs for gaussian_update in 4 minutes and 28 seconds (queued for 1 second)
Status Name Job ID Coverage
  Test
failed check_code_style #91807
python

00:00:29

failed test_PyWake #91806
ci-ubuntu

00:04:28

failed test_PyWake_windows #91808
ANMH_old

00:02:21

85.36%
failed trigger_hub_test

 
Name Stage Failure
failed
test_PyWake Test
FAILED py_wake/tests/test_windturbines/test_power_ct_wind_turbines.py::test_TIFromWFM
FAILED py_wake/tests/test_windturbines/test_windturbines.py::test_DeprecatedWindTurbines
FAILED py_wake/tests/test_windturbines/test_windturbines.py::test_WindTurbines
FAILED py_wake/tests/test_windturbines/test_windturbines.py::test_V80_windturbines
FAILED py_wake/tests/test_windturbines/test_windturbines.py::test_IEA37WindTurbines
FAILED py_wake/tests/test_windturbines/test_windturbines.py::test_twotype_windturbines
= 210 failed, 229 passed, 1 skipped, 33 xfailed, 10 warnings in 67.01s (0:01:07) =
Cleaning up file based variables
ERROR: Job failed: exit code 1
failed
test_PyWake_windows Test
FAILED py_wake/tests/test_windturbines/test_power_ct_wind_turbines.py::test_TIFromWFM
FAILED py_wake/tests/test_windturbines/test_windturbines.py::test_DeprecatedWindTurbines
FAILED py_wake/tests/test_windturbines/test_windturbines.py::test_WindTurbines
FAILED py_wake/tests/test_windturbines/test_windturbines.py::test_V80_windturbines
FAILED py_wake/tests/test_windturbines/test_windturbines.py::test_IEA37WindTurbines
FAILED py_wake/tests/test_windturbines/test_windturbines.py::test_twotype_windturbines
=========== 227 failed, 246 passed, 8 warnings in 120.22s (0:02:00) ===========
Cleaning up file based variables
ERROR: Job failed: exit status 1
failed
check_code_style Test
Installing collected packages: xarray, autograd, py-wake
Running setup.py develop for py-wake
Successfully installed autograd-1.3 py-wake xarray-0.20.1
$ pycodestyle --ignore=E501,W504,E741 py_wake
py_wake/deficit_models/gaussian.py:289:14: W503 line break before binary operator
py_wake/deficit_models/gaussian.py:318:28: W503 line break before binary operator
py_wake/deficit_models/gaussian.py:339:24: W503 line break before binary operator
py_wake/deficit_models/rathmann.py:64:21: W503 line break before binary operator
py_wake/deficit_models/rathmann.py:186:31: W503 line break before binary operator