fixed two lines crossing

3 jobs for new_algorithms in 1 minute and 23 seconds (queued for 7 seconds)
latest
Name Stage Failure
failed
test_EDWIN Test
>       assert 7495208.24825092 == cost
E assert 7495208.24825092 == 8664850.991701005

ed_win/tests/test_wind_farm_network.py:81: AssertionError
=========================== short test summary info ============================
FAILED ed_win/tests/test_wind_farm_network.py::test_wind_farm_network - asser...
============================== 1 failed in 5.89s ===============================
Cleaning up file based variables
ERROR: Job failed: exit code 1
failed
check_code_style Test
ed_win/drivers/ncc/bellman_ford.py:119:1: W293 blank line contains whitespace
ed_win/drivers/ncc/bellman_ford.py:123:1: W293 blank line contains whitespace
ed_win/drivers/ncc/crossings.py:311:21: E265 block comment should start with '# '
ed_win/drivers/ncc/__obsolete/c_mst.py:220:23: E712 comparison to False should be 'if cond is False:' or 'if not cond:'
ed_win/drivers/ncc/__obsolete/two_lines_intersecting.py:39:9: E265 block comment should start with '# '
ed_win/drivers/ncc/__obsolete/two_lines_intersecting.py:40:9: E265 block comment should start with '# '
ed_win/drivers/ncc/__obsolete/two_lines_intersecting.py:53:9: E265 block comment should start with '# '
ed_win/drivers/ncc/__obsolete/two_lines_intersecting.py:54:9: E265 block comment should start with '# '
ed_win/drivers/ncc/__obsolete/two_lines_intersecting.py:103:21: E265 block comment should start with '# '
failed
test_EDWIN_windows Test

5 files skipped due to complete coverage.

Required test coverage of 10.0% reached. Total coverage: 42.24%
=========================== short test summary info ===========================
FAILED ed_win/tests/test_wind_farm_network.py::test_wind_farm_network - asser...
============================== 1 failed in 2.12s ==============================
Cleaning up file based variables
ERROR: Job failed: exit status 1